Paste Code
Paste Blends
Paste Images
client-gtk2.c:107:2: error: stray '\304' in program
client-gtk2.c:107:2: error: stray '\260' in program
client-gtk2.c:107:11: error: expected ',' or '}' before 'NDOW'
client-gtk2.c: In function 'menu_get_ui':
client-gtk2.c:260:3: error: stray '\304' in program
client-gtk2.c:260:3: error: stray '\260' in program
client-gtk2.c:260:12: error: 'GTK_IS_MENU_' undeclared (first use in this function)
client-gtk2.c:260:12: note: each undeclared identifier is reported only once for each function it appears in
client-gtk2.c:260:26: error: expected ';' before 'TEM'
client-gtk2.c: In function 'menu_emit':
client-gtk2.c:301:2: error: stray '\304' in program
client-gtk2.c:301:2: error: stray '\260' in program
client-gtk2.c:301:6: error: 'GTK_IS_TEAROFF_MENU_' undeclared (first use in this function)
client-gtk2.c:301:28: error: expected ')' before 'TEM'
client-gtk2.c:305:2: error: stray '\304' in program
client-gtk2.c:305:2: error: stray '\260' in program
client-gtk2.c:305:6: error: 'GTK_IS_SEPARATOR_MENU_' undeclared (first use in this function)
client-gtk2.c:305:30: error: expected ')' before 'TEM'
client-gtk2.c:309:2: error: stray '\304' in program
client-gtk2.c:309:2: error: stray '\260' in program
client-gtk2.c:309:6: error: 'GTK_IS_MENU_' undeclared (first use in this function)
client-gtk2.c:309:20: error: expected ')' before 'TEM'
client-gtk2.c:312:3: error: stray '\304' in program
client-gtk2.c:312:3: error: stray '\260' in program
client-gtk2.c:312:41: error: expected ')' before 'TEM'
client-gtk2.c: In function '_lambda3_':
client-gtk2.c:327:2: error: stray '\304' in program
client-gtk2.c:327:2: error: stray '\260' in program
client-gtk2.c:327:6: error: 'GTK_IS_W' undeclared (first use in this function)
client-gtk2.c:327:16: error: expected ')' before 'NDOW'
client-gtk2.c:334:2: error: stray '\304' in program
client-gtk2.c:334:2: error: stray '\260' in program
client-gtk2.c:334:16: error: expected ')' before 'NDOW'
client-gtk2.c: In function 'menu_construct':
client-gtk2.c:361:2: error: stray '\304' in program
client-gtk2.c:361:2: error: stray '\260' in program
client-gtk2.c:361:6: error: 'GTK_IS_W' undeclared (first use in this function)
client-gtk2.c:361:16: error: expected ')' before 'NDOW'
client-gtk2.c: In function '_lambda6_':
client-gtk2.c:396:3: error: stray '\304' in program
client-gtk2.c:396:3: error: stray '\260' in program
client-gtk2.c:396:32: error: 'G_' undeclared (first use in this function)
client-gtk2.c:396:36: error: expected ')' before 'O_ERROR'
client-gtk2.c: In function 'menu_register':
client-gtk2.c:456:3: error: stray '\304' in program
client-gtk2.c:456:3: error: stray '\260' in program
client-gtk2.c:456:32: error: 'G_' undeclared (first use in this function)
client-gtk2.c:456:36: error: expected ')' before 'O_ERROR'
client-gtk2.c:476:3: error: stray '\304' in program
client-gtk2.c:476:3: error: stray '\260' in program
client-gtk2.c:476:36: error: expected ')' before 'O_ERROR'
client-gtk2.c:499:3: error: stray '\304' in program
client-gtk2.c:499:3: error: stray '\260' in program
client-gtk2.c:499:36: error: expected ')' before 'O_ERROR'
client-gtk2.c:518:3: error: stray '\304' in program
client-gtk2.c:518:3: error: stray '\260' in program
client-gtk2.c:518:36: error: expected ')' before 'O_ERROR'
client-gtk2.c: In function 'menu_lost':
client-gtk2.c:575:3: error: stray '\304' in program
client-gtk2.c:575:3: error: stray '\260' in program
client-gtk2.c:575:32: error: 'G_' undeclared (first use in this function)
client-gtk2.c:575:36: error: expected ')' before 'O_ERROR'
client-gtk2.c: In function '_lambda0_':
client-gtk2.c:778:3: error: stray '\304' in program
client-gtk2.c:778:3: error: stray '\260' in program
client-gtk2.c:778:28: error: 'GTK_IS_MENU_' undeclared (first use in this function)
client-gtk2.c:778:42: error: expected ')' before 'TEM'
client-gtk2.c: In function 'menu_get_widget':
client-gtk2.c:861:12: warning: assignment from incompatible pointer type [enabled by default]
client-gtk2.c: In function 'menu_serialize_to':
client-gtk2.c:962:2: error: stray '\304' in program
client-gtk2.c:962:2: error: stray '\260' in program
client-gtk2.c:962:6: error: 'GTK_IS_SEPARATOR_MENU_' undeclared (first use in this function)
client-gtk2.c:962:30: error: expected ')' before 'TEM'
client-gtk2.c:965:3: error: stray '\304' in program
client-gtk2.c:965:3: error: stray '\260' in program
client-gtk2.c:965:7: error: 'GTK_IS_TEAROFF_MENU_' undeclared (first use in this function)
client-gtk2.c:965:29: error: expected ')' before 'TEM'
client-gtk2.c:968:4: error: stray '\304' in program
client-gtk2.c:968:4: error: stray '\260' in program
client-gtk2.c:968:8: error: 'GTK_IS_RAD' undeclared (first use in this function)
client-gtk2.c:968:20: error: expected ')' before 'O_MENU_'
client-gtk2.c:968:20: error: stray '\304' in program
client-gtk2.c:968:20: error: stray '\260' in program
client-gtk2.c:971:5: error: stray '\304' in program
client-gtk2.c:971:5: error: stray '\260' in program
client-gtk2.c:971:9: error: 'GTK_IS_CHECK_MENU_' undeclared (first use in this function)
client-gtk2.c:971:29: error: expected ')' before 'TEM'
client-gtk2.c:974:6: error: stray '\304' in program
client-gtk2.c:974:6: error: stray '\260' in program
client-gtk2.c:974:10: error: 'GTK_IS_MENU_' undeclared (first use in this function)
client-gtk2.c:974:24: error: expected ')' before 'TEM'
client-gtk2.c:983:2: error: stray '\304' in program
client-gtk2.c:983:2: error: stray '\260' in program
client-gtk2.c:983:20: error: expected ')' before 'TEM'
client-gtk2.c:1007:3: error: stray '\304' in program
client-gtk2.c:1007:3: error: stray '\260' in program
client-gtk2.c:1007:53: error: expected ')' before 'TEM'
client-gtk2.c:1018:3: error: stray '\304' in program
client-gtk2.c:1018:3: error: stray '\260' in program
client-gtk2.c:1018:82: error: expected ')' before 'TEM'
client-gtk2.c:1036:2: error: stray '\304' in program
client-gtk2.c:1036:2: error: stray '\260' in program
client-gtk2.c:1036:18: error: expected ')' before 'O_MENU_'
client-gtk2.c:1036:18: error: stray '\304' in program
client-gtk2.c:1036:18: error: stray '\260' in program
client-gtk2.c:1041:3: error: stray '\304' in program
client-gtk2.c:1041:3: error: stray '\260' in program
client-gtk2.c:1041:56: error: expected ')' before 'O_MENU_'
client-gtk2.c:1041:56: error: stray '\304' in program
client-gtk2.c:1041:56: error: stray '\260' in program
client-gtk2.c:1045:2: error: stray '\304' in program
client-gtk2.c:1045:2: error: stray '\260' in program
client-gtk2.c:1045:26: error: expected ')' before 'TEM'
client-gtk2.c:1052:3: error: stray '\304' in program
client-gtk2.c:1052:3: error: stray '\260' in program
client-gtk2.c:1052:65: error: expected ')' before 'TEM'
client-gtk2.c: In function '_lambda2_':
client-gtk2.c:1114:3: error: stray '\304' in program
client-gtk2.c:1114:3: error: stray '\260' in program
client-gtk2.c:1114:7: error: 'GTK_IS_CONTA' undeclared (first use in this function)
client-gtk2.c:1114:21: error: expected ')' before 'NER'
client-gtk2.c: In function 'menu_widget_by_type':
client-gtk2.c:1140:2: error: stray '\304' in program
client-gtk2.c:1140:2: error: stray '\260' in program
client-gtk2.c:1140:24: error: 'GTK_IS_CONTA' undeclared (first use in this function)
client-gtk2.c:1140:38: error: expected ')' before 'NER'
client-gtk2.c:1140:38: error: too few arguments to function 'gtk_container_forall'
/usr/include/gtk-2.0/gtk/gtkcontainer.h:208:9: note: declared here
client-gtk2.c: In function 'menu_class_init':
client-gtk2.c:1170:2: error: stray '\304' in program
client-gtk2.c:1170:2: error: stray '\260' in program
client-gtk2.c:1170:68: error: expected ')' before 'NDOW'
client-gtk2.c:1170:68: error: too few arguments to function 'g_object_class_install_property'
/usr/include/glib-2.0/gobject/gobject.h:383:13: note: declared here
client-gtk2.c: In function '_vala_menu_get_property':
client-gtk2.c:1206:3: error: stray '\304' in program
client-gtk2.c:1206:3: error: stray '\260' in program
client-gtk2.c:1206:17: error: expected ':' or '...' before 'NDOW'
client-gtk2.c: In function '_vala_menu_set_property':
client-gtk2.c:1220:3: error: stray '\304' in program
client-gtk2.c:1220:3: error: stray '\260' in program
client-gtk2.c:1220:17: error: expected ':' or '...' before 'NDOW'
client-gtk2.c: In function 'manager_proxy_add':
client-gtk2.c:1410:2: error: stray '\304' in program
client-gtk2.c:1410:2: error: stray '\260' in program
client-gtk2.c:1410:2: error: unknown type name 'G_'
client-gtk2.c: In function '_vala_main':
client-gtk2.c:1573:3: error: stray '\304' in program
client-gtk2.c:1573:3: error: stray '\260' in program
client-gtk2.c:1573:32: error: 'G_' undeclared (first use in this function)
client-gtk2.c:1573:36: error: expected ')' before 'O_ERROR'
make[3]: *** [libglobalmenu_gtk2_la-client-gtk2.lo] Hata 1
make[3]: `/tmp/yaourt-tmp-root/aur-gnome-globalmenu-git/src/gnome-globalmenu-build/src' dizininden çıkılıyor
make[2]: *** [all] Hata 2
make[2]: `/tmp/yaourt-tmp-root/aur-gnome-globalmenu-git/src/gnome-globalmenu-build/src' dizininden çıkılıyor
make[1]: *** [all-recursive] Hata 1
make[1]: `/tmp/yaourt-tmp-root/aur-gnome-globalmenu-git/src/gnome-globalmenu-build' dizininden çıkılıyor
make: *** [all] Hata 2
==> HATA: build() içinde bir hata oluştu.
Çıkılıyor...
==> ERROR: Makepkg was unable to build gnome-globalmenu-git.
==> Restart building gnome-globalmenu-git ? [y/N]
==> ---------------------------------------------
  1. client-gtk2.c:107:2: error: stray '\304' in program
  2. client-gtk2.c:107:2: error: stray '\260' in program
  3. client-gtk2.c:107:11: error: expected ',' or '}' before 'NDOW'
  4. client-gtk2.c: In function 'menu_get_ui':
  5. client-gtk2.c:260:3: error: stray '\304' in program
  6. client-gtk2.c:260:3: error: stray '\260' in program
  7. client-gtk2.c:260:12: error: 'GTK_IS_MENU_' undeclared (first use in this function)
  8. client-gtk2.c:260:12: note: each undeclared identifier is reported only once for each function it appears in
  9. client-gtk2.c:260:26: error: expected ';' before 'TEM'
  10. client-gtk2.c: In function 'menu_emit':
  11. client-gtk2.c:301:2: error: stray '\304' in program
  12. client-gtk2.c:301:2: error: stray '\260' in program
  13. client-gtk2.c:301:6: error: 'GTK_IS_TEAROFF_MENU_' undeclared (first use in this function)
  14. client-gtk2.c:301:28: error: expected ')' before 'TEM'
  15. client-gtk2.c:305:2: error: stray '\304' in program
  16. client-gtk2.c:305:2: error: stray '\260' in program
  17. client-gtk2.c:305:6: error: 'GTK_IS_SEPARATOR_MENU_' undeclared (first use in this function)
  18. client-gtk2.c:305:30: error: expected ')' before 'TEM'
  19. client-gtk2.c:309:2: error: stray '\304' in program
  20. client-gtk2.c:309:2: error: stray '\260' in program
  21. client-gtk2.c:309:6: error: 'GTK_IS_MENU_' undeclared (first use in this function)
  22. client-gtk2.c:309:20: error: expected ')' before 'TEM'
  23. client-gtk2.c:312:3: error: stray '\304' in program
  24. client-gtk2.c:312:3: error: stray '\260' in program
  25. client-gtk2.c:312:41: error: expected ')' before 'TEM'
  26. client-gtk2.c: In function '_lambda3_':
  27. client-gtk2.c:327:2: error: stray '\304' in program
  28. client-gtk2.c:327:2: error: stray '\260' in program
  29. client-gtk2.c:327:6: error: 'GTK_IS_W' undeclared (first use in this function)
  30. client-gtk2.c:327:16: error: expected ')' before 'NDOW'
  31. client-gtk2.c:334:2: error: stray '\304' in program
  32. client-gtk2.c:334:2: error: stray '\260' in program
  33. client-gtk2.c:334:16: error: expected ')' before 'NDOW'
  34. client-gtk2.c: In function 'menu_construct':
  35. client-gtk2.c:361:2: error: stray '\304' in program
  36. client-gtk2.c:361:2: error: stray '\260' in program
  37. client-gtk2.c:361:6: error: 'GTK_IS_W' undeclared (first use in this function)
  38. client-gtk2.c:361:16: error: expected ')' before 'NDOW'
  39. client-gtk2.c: In function '_lambda6_':
  40. client-gtk2.c:396:3: error: stray '\304' in program
  41. client-gtk2.c:396:3: error: stray '\260' in program
  42. client-gtk2.c:396:32: error: 'G_' undeclared (first use in this function)
  43. client-gtk2.c:396:36: error: expected ')' before 'O_ERROR'
  44. client-gtk2.c: In function 'menu_register':
  45. client-gtk2.c:456:3: error: stray '\304' in program
  46. client-gtk2.c:456:3: error: stray '\260' in program
  47. client-gtk2.c:456:32: error: 'G_' undeclared (first use in this function)
  48. client-gtk2.c:456:36: error: expected ')' before 'O_ERROR'
  49. client-gtk2.c:476:3: error: stray '\304' in program
  50. client-gtk2.c:476:3: error: stray '\260' in program
  51. client-gtk2.c:476:36: error: expected ')' before 'O_ERROR'
  52. client-gtk2.c:499:3: error: stray '\304' in program
  53. client-gtk2.c:499:3: error: stray '\260' in program
  54. client-gtk2.c:499:36: error: expected ')' before 'O_ERROR'
  55. client-gtk2.c:518:3: error: stray '\304' in program
  56. client-gtk2.c:518:3: error: stray '\260' in program
  57. client-gtk2.c:518:36: error: expected ')' before 'O_ERROR'
  58. client-gtk2.c: In function 'menu_lost':
  59. client-gtk2.c:575:3: error: stray '\304' in program
  60. client-gtk2.c:575:3: error: stray '\260' in program
  61. client-gtk2.c:575:32: error: 'G_' undeclared (first use in this function)
  62. client-gtk2.c:575:36: error: expected ')' before 'O_ERROR'
  63. client-gtk2.c: In function '_lambda0_':
  64. client-gtk2.c:778:3: error: stray '\304' in program
  65. client-gtk2.c:778:3: error: stray '\260' in program
  66. client-gtk2.c:778:28: error: 'GTK_IS_MENU_' undeclared (first use in this function)
  67. client-gtk2.c:778:42: error: expected ')' before 'TEM'
  68. client-gtk2.c: In function 'menu_get_widget':
  69. client-gtk2.c:861:12: warning: assignment from incompatible pointer type [enabled by default]
  70. client-gtk2.c: In function 'menu_serialize_to':
  71. client-gtk2.c:962:2: error: stray '\304' in program
  72. client-gtk2.c:962:2: error: stray '\260' in program
  73. client-gtk2.c:962:6: error: 'GTK_IS_SEPARATOR_MENU_' undeclared (first use in this function)
  74. client-gtk2.c:962:30: error: expected ')' before 'TEM'
  75. client-gtk2.c:965:3: error: stray '\304' in program
  76. client-gtk2.c:965:3: error: stray '\260' in program
  77. client-gtk2.c:965:7: error: 'GTK_IS_TEAROFF_MENU_' undeclared (first use in this function)
  78. client-gtk2.c:965:29: error: expected ')' before 'TEM'
  79. client-gtk2.c:968:4: error: stray '\304' in program
  80. client-gtk2.c:968:4: error: stray '\260' in program
  81. client-gtk2.c:968:8: error: 'GTK_IS_RAD' undeclared (first use in this function)
  82. client-gtk2.c:968:20: error: expected ')' before 'O_MENU_'
  83. client-gtk2.c:968:20: error: stray '\304' in program
  84. client-gtk2.c:968:20: error: stray '\260' in program
  85. client-gtk2.c:971:5: error: stray '\304' in program
  86. client-gtk2.c:971:5: error: stray '\260' in program
  87. client-gtk2.c:971:9: error: 'GTK_IS_CHECK_MENU_' undeclared (first use in this function)
  88. client-gtk2.c:971:29: error: expected ')' before 'TEM'
  89. client-gtk2.c:974:6: error: stray '\304' in program
  90. client-gtk2.c:974:6: error: stray '\260' in program
  91. client-gtk2.c:974:10: error: 'GTK_IS_MENU_' undeclared (first use in this function)
  92. client-gtk2.c:974:24: error: expected ')' before 'TEM'
  93. client-gtk2.c:983:2: error: stray '\304' in program
  94. client-gtk2.c:983:2: error: stray '\260' in program
  95. client-gtk2.c:983:20: error: expected ')' before 'TEM'
  96. client-gtk2.c:1007:3: error: stray '\304' in program
  97. client-gtk2.c:1007:3: error: stray '\260' in program
  98. client-gtk2.c:1007:53: error: expected ')' before 'TEM'
  99. client-gtk2.c:1018:3: error: stray '\304' in program
  100. client-gtk2.c:1018:3: error: stray '\260' in program
  101. client-gtk2.c:1018:82: error: expected ')' before 'TEM'
  102. client-gtk2.c:1036:2: error: stray '\304' in program
  103. client-gtk2.c:1036:2: error: stray '\260' in program
  104. client-gtk2.c:1036:18: error: expected ')' before 'O_MENU_'
  105. client-gtk2.c:1036:18: error: stray '\304' in program
  106. client-gtk2.c:1036:18: error: stray '\260' in program
  107. client-gtk2.c:1041:3: error: stray '\304' in program
  108. client-gtk2.c:1041:3: error: stray '\260' in program
  109. client-gtk2.c:1041:56: error: expected ')' before 'O_MENU_'
  110. client-gtk2.c:1041:56: error: stray '\304' in program
  111. client-gtk2.c:1041:56: error: stray '\260' in program
  112. client-gtk2.c:1045:2: error: stray '\304' in program
  113. client-gtk2.c:1045:2: error: stray '\260' in program
  114. client-gtk2.c:1045:26: error: expected ')' before 'TEM'
  115. client-gtk2.c:1052:3: error: stray '\304' in program
  116. client-gtk2.c:1052:3: error: stray '\260' in program
  117. client-gtk2.c:1052:65: error: expected ')' before 'TEM'
  118. client-gtk2.c: In function '_lambda2_':
  119. client-gtk2.c:1114:3: error: stray '\304' in program
  120. client-gtk2.c:1114:3: error: stray '\260' in program
  121. client-gtk2.c:1114:7: error: 'GTK_IS_CONTA' undeclared (first use in this function)
  122. client-gtk2.c:1114:21: error: expected ')' before 'NER'
  123. client-gtk2.c: In function 'menu_widget_by_type':
  124. client-gtk2.c:1140:2: error: stray '\304' in program
  125. client-gtk2.c:1140:2: error: stray '\260' in program
  126. client-gtk2.c:1140:24: error: 'GTK_IS_CONTA' undeclared (first use in this function)
  127. client-gtk2.c:1140:38: error: expected ')' before 'NER'
  128. client-gtk2.c:1140:38: error: too few arguments to function 'gtk_container_forall'
  129. /usr/include/gtk-2.0/gtk/gtkcontainer.h:208:9: note: declared here
  130. client-gtk2.c: In function 'menu_class_init':
  131. client-gtk2.c:1170:2: error: stray '\304' in program
  132. client-gtk2.c:1170:2: error: stray '\260' in program
  133. client-gtk2.c:1170:68: error: expected ')' before 'NDOW'
  134. client-gtk2.c:1170:68: error: too few arguments to function 'g_object_class_install_property'
  135. /usr/include/glib-2.0/gobject/gobject.h:383:13: note: declared here
  136. client-gtk2.c: In function '_vala_menu_get_property':
  137. client-gtk2.c:1206:3: error: stray '\304' in program
  138. client-gtk2.c:1206:3: error: stray '\260' in program
  139. client-gtk2.c:1206:17: error: expected ':' or '...' before 'NDOW'
  140. client-gtk2.c: In function '_vala_menu_set_property':
  141. client-gtk2.c:1220:3: error: stray '\304' in program
  142. client-gtk2.c:1220:3: error: stray '\260' in program
  143. client-gtk2.c:1220:17: error: expected ':' or '...' before 'NDOW'
  144. client-gtk2.c: In function 'manager_proxy_add':
  145. client-gtk2.c:1410:2: error: stray '\304' in program
  146. client-gtk2.c:1410:2: error: stray '\260' in program
  147. client-gtk2.c:1410:2: error: unknown type name 'G_'
  148. client-gtk2.c: In function '_vala_main':
  149. client-gtk2.c:1573:3: error: stray '\304' in program
  150. client-gtk2.c:1573:3: error: stray '\260' in program
  151. client-gtk2.c:1573:32: error: 'G_' undeclared (first use in this function)
  152. client-gtk2.c:1573:36: error: expected ')' before 'O_ERROR'
  153. make[3]: *** [libglobalmenu_gtk2_la-client-gtk2.lo] Hata 1
  154. make[3]: `/tmp/yaourt-tmp-root/aur-gnome-globalmenu-git/src/gnome-globalmenu-build/src' dizininden çıkılıyor
  155. make[2]: *** [all] Hata 2
  156. make[2]: `/tmp/yaourt-tmp-root/aur-gnome-globalmenu-git/src/gnome-globalmenu-build/src' dizininden çıkılıyor
  157. make[1]: *** [all-recursive] Hata 1
  158. make[1]: `/tmp/yaourt-tmp-root/aur-gnome-globalmenu-git/src/gnome-globalmenu-build' dizininden çıkılıyor
  159. make: *** [all] Hata 2
  160. ==> HATA: build() içinde bir hata oluştu.
  161.     Çıkılıyor...
  162. ==> ERROR: Makepkg was unable to build gnome-globalmenu-git.
  163. ==> Restart building gnome-globalmenu-git ? [y/N]
  164. ==> ---------------------------------------------
  165.  
go to heaven